Forum Discussion
Altera_Forum
Honored Contributor
16 years agoUBIFS build error
I am getting the following compile error after trying to enable UBIFS: mkfs.ubifs.h:48:23: error: uuid/uuid.h: No such file or directory I am fairly new to uClinux. I am investigating por...
Altera_Forum
Honored Contributor
16 years agoThanks for the git reference Hippo.
I guess I spoke too soon about all being good... I am now getting the following error during the compile: boa.elf2flt(.text+0x148c): In function `main': /home/****ett/nios2/nios2-linux/uClinux-dist/user/boa/boa-0.94.14rc21/src/boa.c:94: undefined reference to `daemon' collect2: ld returned 1 exit status make[6]: *** [boa] Error 1 make[6]: Leaving directory `/home/****ett/nios2/nios2-linux/uClinux-dist/user/boa/build-boa-0.94.14rc21/src' make[5]: *** [boa] Error 2 make[5]: Leaving directory `/home/****ett/nios2/nios2-linux/uClinux-dist/user/boa/build-boa-0.94.14rc21' make[4]: *** [pre-build] Error 2 make[4]: Leaving directory `/home/****ett/nios2/nios2-linux/uClinux-dist/user/boa' make[3]: *** [all] Error 2 make[3]: Leaving directory `/home/****ett/nios2/nios2-linux/uClinux-dist/user/boa' make[2]: *** [boa] Error 2 make[2]: Leaving directory `/home/****ett/nios2/nios2-linux/uClinux-dist/user' make[1]: *** [all] Error 2 make[1]: Leaving directory `/home/****ett/nios2/nios2-linux/uClinux-dist/user' make: *** [subdirs] Error 1 I tried disabling boa (although I would prefer having it eventually) and got a little farther but then got an error regarding the cgi-demo: romfs-inst.sh /home/httpd/cgi-bin/cgi_demo cp: cannot create regular file `/home/****ett/nios2/nios2-linux/uClinux-dist/romfs/home/httpd/cgi-bin/cgi_demo': No such file or directory Any thoughts? Thanks, Tim